{"text_format":"1","workbook":"xlsx","n_sheets":15,"sheets":["Clubs","Catégories","Menu","Mode d'emploi","Demande de Carte","Renouvellement de Licence","DOCUMENT UNIQUE LICENCE a","QUESTIONNAIRE DE SANTE MINEUR","DOCUMENT UNIQUE LICENCE","Vérification des Licences ","Feuille Comptable","Demande de Duplicata","DUPLICATA EN COURS D'ANNEE","Correction d'erreur","Feuil1"],"not_rendered":{"charts":0,"images":6,"macros":1,"external_links":5,"defined_names":25,"comments":0,"pivot_tables":0},"unopened":[],"bounds":{"document_bytes":16777216,"sheet_cells":100000,"rows_first":2000,"rows_last":500,"rows_between":2000,"halvings":0,"cell_chars":16384,"cell_head_chars":4096},"cells_cut":0,"cells_raw":0,"read":"whole","date_system":"1900"}

{"sheet":"Clubs","index":0,"n_rows":70,"n_cols":2,"rows_kept":70,"cut":false,"hidden":true,"merged":[]}
["N°Club","Club"]
[1004,"Fidèles Sud Loire"]
[1015,"Boulistes Avrillé"]
[1016,"La boule Angevine"]
[1025,"Les Amis de la Pétanque Trélazéenne"]
[1045,"ASPTT Angers Pétanque"]
[1119,"Intrépide d'Angers"]
[1198,"Club Angevin Amicale Laïque J. ferry"]
[1212,"Pétanque Club Empiré"]
[1249,"Pétanque Club Soulaire et Bourg"]
[1250,"La Rafle d'Angers"]
[1254,"SC Beaucouzé Pétanque"]
[1257,"Pétanque Saint Jean - Saint Martin"]
[1266,"Liberté Pétanque St-Melaine / Aubance"]
[1269,"Ecouflant Pétanque Club"]
{"$rows_left_out":56}
{"sheet":"Catégories","index":1,"n_rows":10,"n_cols":25,"rows_kept":10,"cut":false,"hidden":true,"merged":[[0,4,0,5],[0,6,0,7],[0,19,0,21],[0,22,0,23],[0,13,0,15],[0,16,0,18]]}
["Année","Benjamin","Minime","Cadet","Juniors",null,"Séniors",null,"Vétérans",null,null,"Année","Benjamin","Minime",null,null,"Cadet",null,null,"Juniors",null,null,"Séniors",null,"Vétérans"]
[2017,2008,"2005 - 2006 - 2007","2002 - 2003 - 2004",2000,2001,1958,1999,1957,null,null,2017,2008,2005,2006,2007,2002,2003,2004,2000,null,2001,1958,1999,1957]
[2018,2009,"2006 - 2007 - 2008","2003 - 2004 - 2005",2001,2002,1959,2000,1958,null,null,2018,2009,2006,2007,2008,2003,2004,2005,2001,null,2002,1959,2000,1958]
[2019,2010,"2007 - 2008 - 2009","2004 - 2005 - 2006",2002,2003,1960,2001,1959,null,null,2019,2010,2007,2008,2009,2004,2005,2006,2002,null,2003,1960,2001,1959]
[2020,2011,"2008 - 2009 - 2010","2005 - 2006 - 2007",2003,2004,1961,2002,1960,null,null,2020,2011,2008,2009,2010,2005,2006,2007,2003,null,2004,1961,2002,1960]
[2021,2013,"2010 - 2011 - 2012","2007 - 2008 - 2009",2004,2006,1962,2003,1961,null,null,2021,2013,2010,2011,2012,2007,2008,2009,2004,null,2006,1962,2003,1961]
[2022,2014,"2011 - 2012 - 2013","2008 - 2009 - 2010",2005,2007,1963,2004,1962,null,null,2022,2014,2011,2012,2013,2008,2009,2010,2005,2006,2007,1963,2004,1962]
[2023,2015,"2012 - 2013 - 2014","2009 - 2010 - 2011",2006,2008,1964,2005,1963,null,null,2023,2015,2012,2013,2014,2009,2010,2011,2006,2007,2008,1964,2005,1963]
[2024,2016,"2013 - 2014 - 2015","2010 - 2011 - 2012",2007,2009,1965,2006,1964,null,null,2024,2015,2013,2014,2015,2010,2011,2012,2007,2008,2009,1965,2006,1964]
[2025,2016,"2013 - 2014 - 2015","2010 - 2011 - 2012",2008,2009,1966,2007,1965,null,null,2025,2016,2013,2014,2015,2010,2011,2012,2008,2009,2010,1966,2007,1965]

{"sheet":"Menu","index":2,"n_rows":15,"n_cols":10,"rows_kept":15,"cut":false,"hidden":false,"merged":[[17,1,17,4],[0,0,0,5],[1,0,1,5],[3,3,3,4],[6,1,6,4]]}
["Fédération Française de Pétanque et jeu Provençal",null,null,null,null,null,null,null,null,{"$f":"B7-1","v":2023}]
["Région des Pays de la Loire - Comité de Maine et Loire"]
[]
["N°Club",null,"Club",{"$f":"IF(B4=\"\",\"\",VLOOKUP(B4,Clubs!A1:B72,2,0))","v":""}]
[]
[]
[null,2024]
[]
[null,"Mode d'emploi",null,"Mode d'emploi"]
[null,"Document unique de licences",null,"Nouveau document fédéral à utiliser pour types de demandes de licences"]
[null,null,null,"CREATION - RENOUVELLEMENT-DUPLICATA - MUTATION"]
[null,null,null,"Il est impératif de cocher la bonne case"]
[null,"Vérification des Licences",null,{"$f":"\"Feuille récapitulative des prises de licence s\"&B7&\", pour les licences qui passent dans le lecteur\"","v":"Feuille récapitulative des prises de licence s2024, pour les licences qui passent dans le lecteur"}]
[null,"Feuille Comptable",null,"Formulaire à joindre impérativement à toutes vos demandes de licences"]
[null,"Correction d'erreur",null,{"$f":"\"La correction intervient après une erreur manuscrite sur la licence \"&B7&\" ( Nom,Prénom, etc…)\"","v":"La correction intervient après une erreur manuscrite sur la licence 2024 ( Nom,Prénom, etc…)"}]
{"$rows_left_out":1}
{"sheet":"Mode d'emploi","index":3,"n_rows":59,"n_cols":2,"rows_kept":59,"cut":false,"hidden":false,"merged":[[46,0,46,2],[49,0,49,2],[57,0,57,2],[52,0,52,2],[1,0,1,2],[3,0,3,2],[23,0,23,2],[37,0,37,2],[16,0,16,2]]}
[]
[{"$f":"\"Comment établir une licence \"&Menu!B7","v":"Comment établir une licence 2024"}]
[]
["CRÉATION DE LICENCE"]
[null,"Nouvelle licence uniquement   (ne jamais avoir été licencié)"]
[null,"Renseignez toutes les lignes "]
[null,"Pour les clubs ou les personnes qui remplissent le formulaire en lettres manuscrites, écrivez en majuscules, de façon claire et compréhensible"]
[null,"Formulaire à signer obligatoirement par le licencié en 2 exemplaires (un pour le club et un pour le comité)"]
[null,"Joindre obligatoirement une photo"]
[null,"Joindre la copie de la carte d'identité ou livret de famille "]
[null,"Demander la carte d'identité ou livret de famille (jeunes) pour établir la 1ère demande de licence"]
[null,"pour les nouveaux joueurs (ses), demander si ils ont joué dans le département ou hors département."]
[null,"pour un étranger, demander la carte de séjour."]
[null,"Pour toute demande de nouvelle licence, joindre obligatoirement une photo récente non estampillée avec le NOM, Prénom et N° club inscrits au dos de celle-ci (ne pas agrafer la photo)"]
[null,"CE FORMULAIRE EST À TRANSMETTRE AU COMITÉ AVEC LA FEUILLE COMPTABLE ACCOMPAGNÉE DU RÈGLEMENT"]
{"$rows_left_out":45}
{"sheet":"Demande de Carte","index":4,"n_rows":54,"n_cols":5,"rows_kept":54,"cut":false,"hidden":true,"merged":[[45,0,45,7],[46,0,46,7],[48,0,48,7],[12,1,12,3],[14,5,14,7],[18,1,18,2],[14,1,14,3],[16,1,16,6],[43,1,43,6],[18,4,18,6],[25,4,25,5],[20,1,20,2],[20,5,20,6],[22,1,22,4],[39,1,39,6],[40,0,40,7],[52,4,52,6],[53,4,53,6],[47,2,47,4],[47,5,47,6],[51,4,51,6],[50,0,50,7],[0,0,0,7],[1,0,1,7],[3,0,3,7],[9,0,9,7],[10,2,10,5],[4,0,4,7],[5,1,5,2],[5,4,5,7],[7,4,7,7],[7,1,7,2],[35,0,35,7],[36,1,36,6],[41,0,41,6],[42,1,42,6],[24,1,24,2],[25,6,25,7],[26,1,26,6],[27,1,27,6],[30,1,30,6],[31,1,31,6],[33,0,33,7],[34,1,34,6]]}
["Fédération Française de Pétanque et Jeu Provençal"]
["Région des Pays de la Loire - Comité de Maine et Loire"]
[]
[{"$f":"\"DEMANDE DE LICENCE \"&Menu!B7","v":"DEMANDE DE LICENCE 2024"}]
["ATTENTION ! A compter de 2018 le coût supplémentaire\npour une demande de carte perdue ou cassée est de 6 €\nsauf mutation"]
["N° de Club",{"$f":"Menu!$B$4","v":0},null,"Club",{"$f":"IF(B6=0,\"\",VLOOKUP(B6,Clubs!A1:B72,2,0))","v":""}]
[]
[{"$f":"\"N° du Club en \"&Menu!J1","v":"N° du Club en 2023"},null,null,null,{"$f":"\"Fournir OBLIGATOIREMENT une mutation si il y un changement de club en \"&Menu!B7","v":"Fournir OBLIGATOIREMENT une mutation si il y un changement de club en 2024"}]
[]
[]
[null,null,"Pour les cartes cassées, joindre licence"]
[]
["N° licence"]
[]
["NOM",null,null,null,"Prénom"]
{"$rows_left_out":40}
{"sheet":"Renouvellement de Licence","index":5,"n_rows":46,"n_cols":7,"rows_kept":46,"cut":false,"hidden":true,"merged":[[36,0,36,7],[34,1,34,2],[35,1,35,2],[43,0,43,7],[45,0,45,1],[37,0,37,7],[38,0,41,1],[38,2,39,2],[38,3,39,4],[38,6,38,7],[41,6,41,7],[39,6,39,7],[40,2,41,2],[40,3,41,4],[40,6,40,7],[25,1,25,6],[0,0,0,7],[1,0,1,7],[7,0,7,7],[3,1,3,2],[3,4,3,7],[5,1,5,2],[5,4,5,7],[11,1,11,2],[22,0,22,7],[23,1,23,6],[24,0,24,7],[15,1,15,6],[16,1,16,6],[19,1,19,6],[20,1,20,6],[28,1,28,6],[34,3,35,4],[29,0,29,7],[30,0,30,6],[32,1,32,6],[31,1,31,6],[34,5,35,6]]}
["Fédération Française de Pétanque et Jeu Provencal"]
["Région des Pays de la Loire - Comité de Maine et Loire"]
[]
["N° Club",{"$f":"Menu!$B$4","v":0},null,"Club",{"$f":"IF(B4=0,\"\",VLOOKUP(B4,Clubs!A1:C70,2,0))","v":""}]
[]
[{"$f":"\"N° du Club en \"&Menu!J1","v":"N° du Club en 2023"},null,null,null,{"$f":"\"Fournir OBLIGATOIREMENT une mutation si il y un changement de club en \"&Menu!B7","v":"Fournir OBLIGATOIREMENT une mutation si il y un changement de club en 2024"}]
[]
[{"$f":"\"RENOUVELLEMENT DE LICENCE SAISON \"&Menu!B7","v":"RENOUVELLEMENT DE LICENCE SAISON 2024"}]
[]
["Je,soussigne e)","NOM",null,"Prénom",null,"N°licence"]
[]
["Catégorie",null,null,null,null,"date du certificat médical"]
[]
["Classification ",null," Elite","Honneur","                Promotion"]
[]
{"$rows_left_out":32}
{"sheet":"DOCUMENT UNIQUE LICENCE a","index":6,"n_rows":42,"n_cols":7,"rows_kept":42,"cut":false,"hidden":true,"merged":[[8,2,8,3],[8,4,8,5],[8,6,8,7],[17,0,17,7],[18,1,18,7],[6,0,6,7],[0,0,0,7],[1,1,1,5],[2,3,2,5],[3,2,3,4],[5,0,5,7],[7,0,7,1],[7,2,7,3],[7,5,7,7],[23,2,23,5],[9,0,9,1],[10,1,10,7],[11,3,11,7],[12,1,12,4],[12,6,12,7],[13,0,13,6],[14,2,14,5],[15,0,15,6],[16,0,16,7],[19,0,19,7],[21,0,21,7],[8,0,8,1],[32,6,32,7],[24,0,24,7],[25,0,25,7],[26,2,26,5],[28,0,28,7],[29,2,29,5],[30,0,30,1],[30,2,30,4],[30,5,30,7],[31,0,31,7],[27,0,27,7],[41,0,41,7],[33,2,33,5],[34,0,34,7],[35,0,35,7],[36,0,36,7],[37,0,37,7],[39,2,40,4],[39,5,40,7],[38,0,38,7]]}
["Fédération Française de Pétanque                                                                                                            et de Jeu Provençal"]
[null,"       COMITÉ DÉPARTEMENTAL de Maine et Loire",null,null,null,null,"SAISON                                    "]
[null,"       CLUB :",{"$f":"Menu!B4","v":0},{"$f":"IF(C3=0,\"Veuillez entrer le numero de club\",VLOOKUP(C3,Clubs!A1:B70,2,0))","v":"Veuillez entrer le numero de club"},null,null,{"$f":"Menu!B7","v":2024}]
[null,"      SECTEUR :",{"$f":"IF(C3=\"\",\"\",VLOOKUP(C3,[2]Clubs!A1:C72,3,0))","v":{"$error":"#N/A"}}]
[]
["                              CRÉATION            RENOUVELLEMENT                  DUPLICATA                     MUTATION"]
["Civilité :             M             F         Nationalité :              Française                      Union Européenne                 Etrangère"]
["Nom de naissance: ",null,null,null,"Nom d'usage :"]
["Prénom de naissance: ",null,null,null,"Prénom d'usage: "]
["Date de naissance : ",null,null,"Lieu de naissance:",null,"INSEE:"]
["Adresse:"]
["Code Postal:",null,"Ville:"]
["Courriel:",null,null,null,null,"Téléphone :"]
[]
["N° de licence (si existant):"]
{"$rows_left_out":28}
{"sheet":"QUESTIONNAIRE DE SANTE MINEUR","index":7,"n_rows":0,"n_cols":0,"rows_kept":0,"cut":false,"hidden":false,"merged":[]}

{"sheet":"DOCUMENT UNIQUE LICENCE","index":8,"n_rows":358,"n_cols":38,"rows_kept":358,"cut":false,"hidden":false,"merged":[[0,1,0,8],[1,2,1,6],[3,3,3,5],[5,10,6,10],[6,2,6,3],[6,5,6,7],[5,1,5,8],[7,1,7,4],[7,5,7,8],[8,1,8,4],[8,5,8,8],[9,1,9,3],[9,4,9,7],[10,1,10,8],[11,1,11,2],[11,3,11,8],[12,1,12,5],[12,6,12,8],[13,1,13,7],[14,3,14,6],[15,3,15,5],[16,3,16,5],[17,2,17,8],[18,1,19,8],[21,1,21,8],[23,3,23,6],[24,1,24,8],[25,1,25,8],[26,3,26,6],[27,1,27,8],[28,1,28,8],[29,1,29,8],[30,3,30,6],[31,1,31,5],[31,6,31,8],[32,1,32,8],[33,4,33,6],[33,7,33,8],[40,26,41,29],[34,3,34,6],[35,1,35,8],[36,1,36,8],[37,1,37,8],[38,1,38,8],[42,1,42,8],[55,20,57,20],[39,1,39,8],[40,3,41,5],[40,6,41,8],[40,10,41,12]]}
[null,"Fédération Française de Pétanque et de Jeu Provençal",null,null,null,null,null,null,null,{"$f":"IF(ISERROR(VLOOKUP(K2,'[3]Base de Données'!$B$4:$DZ$206,106,FALSE)),\"\",VLOOKUP(K2,'[3]Base de Données'!$B$4:$DZ$206,106,FALSE))","v":""},{"$f":"YEAR(M1)","v":2023},null,{"$f":"TODAY()","v":"2023-11-28"},0,{"$f":"DATE(K1,10,1)","v":"2023-10-01"},{"$f":"K1+1","v":2024},{"$f":"DATE(P1,1,1)","v":"2024-01-01"},null,{"$f":"IF(ISERROR(VLOOKUP($K$2,#REF!,32,FALSE)),\"\",VLOOKUP($K$2,#REF!,32,FALSE))","v":""},null,null,null,null,null,1]
[null,null,"       COMITÉ DÉPARTEMENTAL de Maine et Loire",null,null,null,null,null,"SAISON                                    ",null,{"$f":"Z8","v":"DOCUMENT UNIQUE LICENCE"},null,{"$f":"IF(ISERROR(LEFT($N$4,2)),\"0\",LEFT($N$4,2))","v":""},{"$f":"LEFT($N$4,2)","v":""},{"$f":"M2","v":""},null,null,null,null,null,null,null,null,null,2]
[null,null,"       CLUB :",{"$f":"IF(AL2<>\"\",$AL$2,Menu!B4)","v":0},{"$f":"IF(AB3=0,\"\",UPPER(AB3))","v":""},null,null,null,{"$f":"IF(AL3<>\"\",AL3,Menu!B7)","v":2024},null,null,null,{"$f":"LEFT($N$4,4)","v":""},{"$f":"LEFT($N$4,4)","v":""},{"$f":"RIGHT(M3,2)","v":""},null,null,null,null,null,null,null,null,null,3,null,null,{"$f":"IF(ISERROR(VLOOKUP(D3,[4]Clubs!$C$3:$E$74,2,FALSE)),\"\",VLOOKUP(D3,[4]Clubs!$C$3:$E$74,2,FALSE))","v":0}]
[null,null,"      SECTEUR :",{"$f":"IF(D3=\"\",\"\",IF(ISERROR(VLOOKUP(D3,[2]Clubs!A1:C72,3,0)),\"\",VLOOKUP(D3,[2]Clubs!A1:C72,3,0)))","v":""},null,null,null,null,null,null,null,null,{"$f":"LEFT($N$4,6)","v":""},{"$f":"IF($AL$16<>\"\",AL16,IF(ISERROR(VLOOKUP($K$2,[4]Catégories!$B$4:$CW$206,13,FALSE)),\"\",VLOOKUP($K$2,[4]Catégories!$B$4:$CW$206,13,FALSE)))","v":""},{"$f":"RIGHT(M4,2)","v":""},null,null,null,null,null,null,null,null,null,4]
[null,null,null,null,null,null,null,null,null,null,null,null,{"$f":"LEFT($N$4,8)","v":""},{"$f":"IF($AL$15<>\"\",$AL$15,IF(ISERROR(VLOOKUP($K$2,[4]Catégories!$B$4:$CW$206,12,FALSE)),\"\",VLOOKUP($K$2,[4]Catégories!$B$4:$CW$206,12,FALSE)))","v":""},{"$f":"RIGHT(M5,2)","v":""},null,null,null,null,null,null,null,null,null,5,null,null,null,null,null,null,null,null,null,null,"NOM de NAISSANCE",2]
[null,"RENOUVELLEMENT DE LICENCE",null,null,null,null,null,null,null,null,null,null,null,{"$f":"IF($AL$11<>\"\",$AL$11,IF(ISERROR(VLOOKUP($K$2,[4]Catégories!$B$4:$CW$206,9,FALSE)),\"\",VLOOKUP($K$2,[4]Catégories!$B$4:$CW$206,9,FALSE)))","v":""},null,null,null,null,null,null,null,null,null,null,6,null,null,null,null,null,null,null,null,null,null,"NOM d'USAGE",3]
[null,{"$f":"\"Civilité : \"","v":"Civilité : "},null,null,{"$f":"\"Nationalité :\"","v":"Nationalité :"},null,null,null,null,null,null,null,null,null,{"$f":"RIGHT(N4,2)","v":""},null,null,null,null,null,null,null,null,null,7,null,null,null,null,null,null,null,null,null,null,"PRÉNOM de NAISSANCE",4]
[null,{"$f":"IF(AL5<>\"\",\"Nom de Naissance :  \"&AL5,IF(N18=\"0\",\"Nom de Naissance : \",\"Nom de Naissance :   \"&N18))","v":"Nom de Naissance :   "},null,null,null,{"$f":"IF(AL6<>\"\",\"Nom d'usage :  \"&AL6,IF(N19=\"0\",\"Nom d'usage: \",\"Nom d'usage:  \"&N19))","v":"Nom d'usage:  "},null,null,null,null,null,null,null,{"$f":"IF(AL9<>\"\",AL9,IF(ISERROR(VLOOKUP($K$2,[4]Catégories!$B$4:$CW$206,6,FALSE)),\"\",VLOOKUP($K$2,[4]Catégories!$B$4:$CW$206,6,FALSE)))","v":""},null,null,null,null,null,null,null,null,null,null,8,{"$f":"RIGHT(CELL(\"nomfichier\",$A$1),LEN(CELL(\"nomfichier\",$A$1))-FIND(\"]\",CELL(\"nomfichier\",$A$1)))","v":"DOCUMENT UNIQUE LICENCE"},null,null,null,null,null,null,null,null,null,"PRÉNOM d'USAGE",5]
[null,{"$f":"IF(AL7<>\"\",\"Prénom de Naissance :  \"&AL7,IF(N24=\"0\",\"Prénom de Naissance : \",\"Prénom de Naissance :   \"&N24))","v":"Prénom de Naissance :   "},null,null,null,{"$f":"IF(AL8<>\"\",\"Prénom d'usage :  \"&AL8,IF(N25=\"0\",\"Prénom d'usage: \",\"Prénom d'usage:  \"&N25))","v":"Prénom d'usage:  "},null,null,null,null,null,null,null,null,null,null,null,null,null,null,null,null,null,null,null,null,null,null,null,null,null,null,null,null,null,"DATE de NAISSANCE",6]
[null,{"$f":"IF(N13=\"00\",\"Date de Naissance : \",IF(N10=\"0\",\"Date de Naissance : \",\"Date de Naissance :   \"&N13&\" / \"&N17&\" / \"&M15))","v":"Date de Naissance : "},null,null,{"$f":"IF(AL10<>\"\",\"Lieu de Naissance :  \"&AL10,IF(N26=0,\"Lieu de Naissance : \",\"Lieu de Naissance :  \"&N26))","v":"Lieu de Naissance :  "},null,null,null,{"$f":"IF(M21=\"0\",\"N° INSEE : \",\"N° INSEE :  \"&M21&\" \"&M22)","v":"N° INSEE :   "},null,null,null,null,{"$f":"IF(ISERROR(DAY(N8)),\"0\",DAY(N8))","v":"0"},null,null,null,null,null,null,null,null,null,null,9,null,null,null,null,null,null,null,null,null,null,"LIEU de NAISSANCE",7]
[null,{"$f":"IF(N21=0,\"Adresse : \",\"Adresse :  \"&N21)","v":"Adresse :  "},null,null,null,null,null,null,null,null,null,null,null,{"$f":"LEN(N10)","v":1},null,null,null,null,null,null,null,null,null,null,10,null,null,null,null,null,null,null,null,null,null,"N° INSEE",8]
[null,{"$f":"IF(M18=\"0\",\"Code Postal : \",\"Code Postal :  \"&M18&\" \"&M19)","v":"Code Postal :   "},null,{"$f":"IF(AL14<>\"\",\"Ville :  \"&AL14,IF(N23=0,\"Ville : \",\"Ville :  \"&N23))","v":"Ville :  "},null,null,null,null,null,null,null,null,null,{"$f":"IF(N11=1,0,\"\")","v":0},null,null,null,null,null,null,null,null,null,null,11,null,null,null,null,null,null,null,null,null,null,"ADRESSE",9]
[null,{"$f":"IF(M23=\"\",\"Courriel : \",\"Courriel :  \"&M24&\"  @  \"&M26)","v":"Courriel : "},null,null,null,null,{"$f":"IF(M2=\"0\",\"Téléphone : \",\"Téléphone :  \"&O2&\" \"&O3&\" \"&O4&\" \"&O5&\" \"&O7)","v":"Téléphone :      "},null,null,null,null,null,null,{"$f":"N12&N10","v":"00"},null,null,null,null,"E","ÉLITE",null,"CRÉATION DE LICENCE",null,null,12,null,null,null,null,null,null,null,null,null,null,"CODE POSTAL",10]
[null,null,null,null,null,null,null,null,null,null,null,null,null,{"$f":"MONTH(N8)","v":{"$error":"#VALUE!"}},null,null,null,null,"H","HONNEUR",null,"RENOUVELLEMENT DE LICENCE",null,null,13,null,null,null,null,null,null,null,null,null,null,"VILLE",11]
[null,"N° de licence (si existant):",null,{"$f":"IF(O27=\"0\",\"\",O27&\" \"&O26)","v":" "},null,null,null,null,null,null,null,null,{"$f":"YEAR(N8)","v":{"$error":"#VALUE!"}},{"$f":"LEN(N14)","v":{"$error":"#VALUE!"}},null,null,null,null,"P","PROMOTION",null,"DUPLICATA DE LICENCE",null,null,14,null,null,null,null,null,null,null,null,null,null,"COURRIEL",12]
{"$rows_left_out":344}
{"sheet":"Vérification des Licences ","index":9,"n_rows":111,"n_cols":34,"rows_kept":111,"cut":false,"hidden":false,"merged":[[9,0,9,9],[6,0,6,8],[12,3,12,18],[2,2,2,12],[3,0,3,8],[9,12,10,18],[8,12,8,18],[10,1,10,6],[0,25,0,27],[4,0,4,8],[0,22,0,24],[0,28,0,30],[0,31,0,32]]}
[{"$f":"IF(Menu!$B$7=\"\",\"\",Menu!$B$7)","v":2024},null,null,null,null,null,null,null,null,null,null,null,null,null,null,null,null,null,null,null,"Année","Benjamin","Minime",null,null,"Cadet",null,null,"Juniors",null,null,"Séniors",null,"Vétérans"]
[null,null,null,null,null,null,null,null,null,null,null,null,null,null,null,null,null,null,null,null,{"$f":"Menu!B7","v":2024},{"$f":"VLOOKUP($U$2,cat,2,0)","v":2015},{"$f":"VLOOKUP($U$2,cat,3,0)","v":2013},{"$f":"VLOOKUP($U$2,cat,4,0)","v":2014},{"$f":"VLOOKUP($U$2,cat,5,0)","v":2015},{"$f":"VLOOKUP($U$2,cat,6,0)","v":2010},{"$f":"VLOOKUP($U$2,cat,7,0)","v":2011},{"$f":"VLOOKUP($U$2,cat,8,0)","v":2012},{"$f":"VLOOKUP($U$2,cat,9,0)","v":2007},{"$f":"VLOOKUP($U$2,cat,10,0)","v":2008},{"$f":"VLOOKUP($U$2,cat,11,0)","v":2009},{"$f":"VLOOKUP($U$2,cat,12,0)","v":1965},{"$f":"VLOOKUP($U$2,cat,13,0)","v":2006},{"$f":"VLOOKUP($U$2,cat,14,0)","v":1964}]
["F.F.P.J.P",null,{"$f":"\"VÉRIFICATION DES LICENCES \"&Menu!B7","v":"VÉRIFICATION DES LICENCES 2024"},null,null,null,null,null,null,null,null,null,null,null,"CD49"]
[]
["dans la case jaune mettre la nouvelle date du certificat"]
[]
["Pour toutes les mutations joindre la feuille rose"]
[]
[null,null,null,null,null,null,null,null,null,null,null,null,"Cachet et signature"]
["Le Président……………………………….certifie exactes les informations figurant sur ce bordereau et que tous les adhérents ont pris connaissance de l'intérêt de sourcrire aux garanties optionnelles,accidents corporels,correspondant à l'option \"avantage\" de la compagnie M.M.A à l'article L.321-4 du code du sport. Que les informations recueillies figurant sur ce formulaire sont exactes et autorise à ce qu'elles fassent l'objet d'un traitement informatique, conformément à la loi du 06/01/1978Je bénéficie d'un droit d'accès et de rectification auprès du siège de  la F.F.P.J.P"]
["DATE"]
[]
["N° de CLUB",{"$f":"Menu!$B$4","v":0},"CLUB",{"$f":"IF(B13=0,\"Veuillez renseigner le numéro de Club\",VLOOKUP(B13,Clubs!A1:B72,2,0))","v":"Veuillez renseigner le numéro de Club"}]
[]
["NOM","Prénom","Né le","A","B","C","D","N° licence","N°Club","Adresse","v","CP","Ville","E","certificat","Dern\nAnn","F","G","H",null,null,"Année de Naissance","Catégorie"]
{"$rows_left_out":97}
{"sheet":"Feuille Comptable","index":10,"n_rows":39,"n_cols":9,"rows_kept":39,"cut":false,"hidden":false,"merged":[[17,7,17,9],[19,7,19,9],[17,1,18,1],[19,1,20,1],[18,8,18,9],[20,8,20,9],[38,0,38,9],[32,3,32,4],[32,5,32,6],[32,7,32,9],[34,3,34,4],[34,5,34,6],[34,7,34,9],[36,2,36,3],[28,2,28,8],[23,1,23,2],[22,1,22,2],[21,1,21,2],[24,1,24,2],[21,8,21,9],[26,7,26,9],[26,4,26,5],[15,1,16,1],[9,7,9,9],[13,8,13,9],[14,7,14,9],[13,1,14,1],[10,7,10,9],[11,7,11,9],[12,7,12,9],[9,1,10,1],[11,1,12,1],[16,8,16,9],[15,7,15,9],[6,8,6,9],[8,7,8,9],[0,1,0,9],[1,1,1,9],[4,8,4,9],[4,2,4,7],[5,1,5,9],[6,2,6,6],[3,2,3,7],[2,2,2,7]]}
[null,"FÉDÉRATION FRANCAISE DE PÉTANQUE ET DE JEU PROVENÇAL"]
[null,"COMITÉ DE MAINE ET LOIRE"]
[null,null,"FEUILLE COMPTABLE 2024"]
[null,null,"2023-10-24"]
[null,null,"Il est obligatoire que ce document soit rempli informatiquement, et doit être joint impérativement à chaque demande de licences"]
[]
[null,"CLUB",{"$f":"IF(I7=0,\"\",VLOOKUP(I7,Clubs!A1:B72,2,0))","v":""},null,null,null,null,"N°",{"$f":"Menu!$B$4","v":0}]
[]
[null,"année","CATEGORIE","NOMBRE","PRIX UNITAIRE","TOTAL",null,"Réservé  Comité"]
[null,"1964 et avant ","VETERANS MASCULINS ",null,34,{"$f":"E10*D10","v":0},null,"Date d'arrivée au comité"]
[null,null,"VETERANS FEMININES ",null,34,{"$f":"E11*D11","v":0}]
[null,"1965 à 2006","SENIORS MASCULINS ",null,34,0,null,"Controlé par :"]
[null,null,"SENIORS FEMININES ",null,34,0]
[null,"2007 à 2009","JUNIORS MASCULINS ",null,24,0,null,"Date"]
[null,null,"JUNIORS FEMININES ",null,24,0,null,"Traité par :"]
{"$rows_left_out":25}
{"sheet":"Demande de Duplicata","index":11,"n_rows":25,"n_cols":7,"rows_kept":25,"cut":false,"hidden":true,"merged":[[15,1,15,5],[17,3,17,5],[21,1,21,3],[23,1,23,4],[11,1,11,2],[11,4,11,5],[13,2,13,4],[19,1,19,3],[9,1,9,2],[0,0,0,6],[1,0,1,6],[3,0,3,6],[5,1,5,5],[7,1,7,4]]}
["Fédération Française de Pétanque et Jeu Provençal"]
["Région des Pays de la Loire - Comité de Maine et Loire"]
[]
["DEMANDE DE DUPLICATA"]
[]
[null,"ATTESTATION"]
[]
["Club",{"$f":"IF(G8=0,\"\",VLOOKUP(G8,Clubs!A1:B72,2,0))","v":""},null,null,null,"N°",{"$f":"Menu!$B$4","v":0}]
[]
["N° licence",null,null,null,null,null,"réservé Comité"]
[]
["NOM",null,null,"prénom",null,null,"Vétérans 20 €"]
[]
["date de naissance",null,null,null,null,null,"Séniors 20 €"]
[]
{"$rows_left_out":11}
{"sheet":"DUPLICATA EN COURS D'ANNEE","index":12,"n_rows":25,"n_cols":7,"rows_kept":25,"cut":false,"hidden":false,"merged":[[21,1,21,3],[23,1,23,4],[11,1,11,2],[11,4,11,5],[13,2,13,4],[15,1,15,5],[17,3,17,5],[19,1,19,3],[9,1,9,2],[0,0,0,6],[1,0,1,6],[3,0,3,6],[5,1,5,5],[7,1,7,4]]}
["Fédération Française de Pétanque et Jeu Provençal"]
["Région des Pays de la Loire - Comité de Maine et Loire"]
[]
["DEMANDE DE DUPLICATA"]
[]
[null,"ATTESTATION"]
[]
["Club",{"$f":"IF(G8=0,\"\",VLOOKUP(G8,[5]Clubs!A1:B74,2,0))","v":""},null,null,null,"N°",{"$f":"[5]Menu!$B$4","v":0}]
[]
["N° licence",null,null,null,null,null,"réservé Comité"]
[]
["NOM",null,null,"prénom",null,null,"Vétérans 20 €"]
[]
["date de naissance",null,null,null,null,null,"Séniors 20 €"]
[]
{"$rows_left_out":11}
{"sheet":"Correction d'erreur","index":13,"n_rows":30,"n_cols":9,"rows_kept":30,"cut":false,"hidden":false,"merged":[[25,0,25,9],[27,2,27,3],[29,1,29,4],[15,2,15,4],[24,8,24,9],[0,1,0,9],[1,1,1,9],[3,1,3,9],[5,1,5,4],[5,6,5,9],[13,2,13,3],[24,1,24,2],[7,2,7,3],[7,7,7,8],[9,2,9,4],[9,7,9,9],[11,2,11,4],[11,7,11,8],[24,6,24,7]]}
[null,"Fédération Française de Pétanque et Jeu Provençal"]
[null,"Région des Pays de la Loire - Comité de Maine et Loire"]
[]
[null,"CORRECTION D'ERREUR"]
[]
[null,"LICENCE ACTUELLE",null,null,null,null,"NOUVELLE LICENCE"]
[]
[null,"N° licence",null,null,null,null,"N° licence"]
[]
[null,"NOM",null,null,null,null,"NOM"]
[]
[null,"Prénom",null,null,null,null,"Prénom"]
[]
[null,"Né le",null,null,null,null,"Né le"]
[]
{"$rows_left_out":16}
{"sheet":"Feuil1","index":14,"n_rows":0,"n_cols":0,"rows_kept":0,"cut":false,"hidden":true,"merged":[]}